Reaction Details
TargetMuscarinic acetylcholine receptor M2
LigandBDBM50092996
Substrate/Competitorn/a
Meas. Tech.ChEBML_139763
Ki 0.600000±n/a nM
Citation Kozlowski, JALowe, DBGuzik, HSZhou, GRuperto, VBDuffy, RAMcQuade, RCrosby, GTaylor, LABillard, WBinch, HLachowicz, JE Diphenyl sulfoxides as selective antagonists of the muscarinic M2 receptor. Bioorg Med Chem Lett10:2255-7 (2001) Muscarinic acetylcholine receptor M2
Name:Muscarinic acetylcholine receptor M2
Type:GPCR
Mol. Mass.:51730.61
Organism:Homo sapiens (Human)
Description:P08172
Residue:466
BDBM50092996
NameBDBM50092996
Synonyms:1-Cyclohexyl-4-{1-[4-(4-methoxy-benzenesulfonyl)-phenyl]-ethyl}-piperazine | CHEMBL310912
TypeSmall organic molecule
Emp. Form.C25H34N2O3S
Mol. Mass.442.614
SMILESCOc1ccc(cc1)S(=O)(=O)c1ccc(cc1)C(C)N1CCN(CC1)C1CCCCC1