Reaction Details
TargetBeta-1 adrenergic receptor
LigandBDBM50019355
Substrate/Competitorn/a
Meas. Tech.ChEMBL_38260 (CHEMBL646903)
IC50 6.1±n/a nM
Citation Parmee, ERBrockunier, LLHe, JSingh, SBCandelore, MRCascieri, MADeng, LLiu, YTota, LWyvratt, MJFisher, MHWeber, AE Tetrahydroisoquinoline derivatives containing a benzenesulfonamide moiety as potent, selective human beta3 adrenergic receptor agonists. Bioorg Med Chem Lett10:2283-6 (2001) Beta-1 adrenergic receptor
Name:Beta-1 adrenergic receptor
Type:G Protein-Coupled Receptor (GPCR)
Mol. Mass.:51338.40
Organism:Homo sapiens (Human)
Description:P08588
Residue:477
BDBM50019355
NameBDBM50019355
Synonyms:1-(3,4,5-Trimethoxy-benzyl)-1,2,3,4-tetrahydro-isoquinoline-6,7-diol CHEMBL299175 TMQ, Racemic | Tretoquinol
TypeSmall organic molecule
Emp. Form.C19H23NO5
Mol. Mass.345.3896
SMILESCOc1cc(CC2NCCc3cc(O)c(O)cc23)cc(OC)c1OC