Reaction Details
TargetTryptase beta-2
LigandBDBM50093136
Substrate/Competitorn/a
Meas. Tech.ChEBML_210829
Ki 40±n/a nM
Citation Rice, KDGangloff, ARKuo, EYDener, JMWang, VRLum, RNewcomb, WSHavel, CPutnam, DCregar, LWong, MWarne, RL Dibasic inhibitors of human mast cell tryptase. Part 1: synthesis and optimization of a novel class of inhibitors. Bioorg Med Chem Lett10:2357-60 (2001) Tryptase beta-2
Name:Tryptase beta-2
Type:PROTEIN
Mol. Mass.:30518.79
Organism:Homo sapiens (Human)
Description:ChEMBL_210702
Residue:275
BDBM50093136
NameBDBM50093136
Synonyms:CHEMBL309788 | N-(4-Guanidino-benzyl)-N'-(4-{[3-(4-guanidino-benzylcarbamoyl)-propionylamino]-methyl}-benzyl)-succinamide
TypeSmall organic molecule
Emp. Form.C32H40N10O4
Mol. Mass.628.7246
SMILES[#7]\[#6](-[#7])=[#7]/c1ccc(-[#6]-[#7]-[#6](=O)-[#6]-[#6]-[#6](=O)-[#7]-[#6]-c2ccc(-[#6]-[#7]-[#6](=O)-[#6]-[#6]-[#6](=O)-[#7]-[#6]-c3ccc(cc3)\[#7]=[#6](/[#7])-[#7])cc2)cc1