Reaction Details
TargetSerine protease 1
LigandBDBM50093140
Substrate/Competitorn/a
Meas. Tech.ChEBML_212894
Ki 44000±n/a nM
Citation Rice, KDGangloff, ARKuo, EYDener, JMWang, VRLum, RNewcomb, WSHavel, CPutnam, DCregar, LWong, MWarne, RL Dibasic inhibitors of human mast cell tryptase. Part 1: synthesis and optimization of a novel class of inhibitors. Bioorg Med Chem Lett10:2357-60 (2001) Serine protease 1
Name:Serine protease 1
Type:Enzyme
Mol. Mass.:26557.80
Organism:Homo sapiens (Human)
Description:P07477
Residue:247
BDBM50093140
NameBDBM50093140
Synonyms:CHEMBL43463 | Derivative of piperazine-1-carboxylic acid 5-(piperazine-1-carbonyloxy)-cyclooctyl ester
TypeSmall organic molecule
Emp. Form.C34H46N6O6
Mol. Mass.634.7656
SMILESO=C(NCc1ccccc1)N1CCN(CC1)C(=O)O[C@H]1CCC[C@H](CCC1)OC(=O)N1CCN(CC1)C(=O)NCc1ccccc1