Reaction Details
TargetPlasminogen
LigandBDBM50093144
Substrate/Competitorn/a
Meas. Tech.ChEBML_155238
Ki>1000000±n/a nM
Citation Rice, KDGangloff, ARKuo, EYDener, JMWang, VRLum, RNewcomb, WSHavel, CPutnam, DCregar, LWong, MWarne, RL Dibasic inhibitors of human mast cell tryptase. Part 1: synthesis and optimization of a novel class of inhibitors. Bioorg Med Chem Lett10:2357-60 (2001) Plasminogen
Name:Plasminogen
Type:Enzyme
Mol. Mass.:90579.18
Organism:Homo sapiens (Human)
Description:n/a
Residue:810
BDBM50093144
NameBDBM50093144
Synonyms:CHEMBL46120 | N-(4-Guanidino-benzyl)-N'-(4-{[2-(4-guanidino-benzylcarbamoyl)-acetylamino]-methyl}-benzyl)-malonamide
TypeSmall organic molecule
Emp. Form.C30H36N10O4
Mol. Mass.600.6714
SMILES[#7]\[#6](-[#7])=[#7]/c1ccc(-[#6]-[#7]-[#6](=O)-[#6]-[#6](=O)-[#7]-[#6]-c2ccc(-[#6]-[#7]-[#6](=O)-[#6]-[#6](=O)-[#7]-[#6]-c3ccc(cc3)\[#7]=[#6](\[#7])-[#7])cc2)cc1