Reaction Details
TargetProthrombin
LigandBDBM50093138
Substrate/Competitorn/a
Meas. Tech.ChEBML_208334
Ki>1000000±n/a nM
Citation Rice, KDGangloff, ARKuo, EYDener, JMWang, VRLum, RNewcomb, WSHavel, CPutnam, DCregar, LWong, MWarne, RL Dibasic inhibitors of human mast cell tryptase. Part 1: synthesis and optimization of a novel class of inhibitors. Bioorg Med Chem Lett10:2357-60 (2001) Prothrombin
Name:Prothrombin
Type:Protein
Mol. Mass.:70029.57
Organism:Homo sapiens (Human)
Description:P00734
Residue:622
BDBM50093138
NameBDBM50093138
Synonyms:CHEMBL78757 | N-(4-Aminomethyl-benzyl)-N'-[4-({3-[(4-aminomethyl-benzyl)-methyl-carbamoyl]-propionylamino}-methyl)-benzyl]-N-methyl-succinamide
TypeSmall organic molecule
Emp. Form.C34H44N6O4
Mol. Mass.600.751
SMILESCN(Cc1ccc(CN)cc1)C(=O)CCC(=O)NCc1ccc(CNC(=O)CCC(=O)N(C)Cc2ccc(CN)cc2)cc1