Reaction Details
TargetPlasminogen
LigandBDBM50084616
Substrate/Competitorn/a
Meas. Tech.ChEBML_155238
Ki>1000000±n/a nM
Citation Rice, KDGangloff, ARKuo, EYDener, JMWang, VRLum, RNewcomb, WSHavel, CPutnam, DCregar, LWong, MWarne, RL Dibasic inhibitors of human mast cell tryptase. Part 1: synthesis and optimization of a novel class of inhibitors. Bioorg Med Chem Lett10:2357-60 (2001) Plasminogen
Name:Plasminogen
Type:Enzyme
Mol. Mass.:90579.18
Organism:Homo sapiens (Human)
Description:n/a
Residue:810
BDBM50084616
NameBDBM50084616
Synonyms:CHEMBL310290 | [(4-Aminomethyl-benzylcarbamoyl)-methyl]-carbamic acid 4-[(4-aminomethyl-benzylcarbamoyl)-methylcarbamoyloxymethyl]-benzyl ester
TypeSmall organic molecule
Emp. Form.C30H36N6O6
Mol. Mass.576.6434
SMILESNCc1ccc(CNC(=O)CNC(=O)OCc2ccc(COC(=O)NCC(=O)NCc3ccc(CN)cc3)cc2)cc1