Reaction Details
TargetTryptase beta-2/delta/gamma
LigandBDBM50093175
Substrate/Competitorn/a
Meas. Tech.ChEMBL_210830 (CHEMBL811859)
Ki 0.100000±n/a nM
Citation Rice, KDWang, VRGangloff, ARKuo, EYDener, JMNewcomb, WSYoung, WBPutnam, DCregar, LWong, MSimpson, PJ Dibasic inhibitors of human mast cell tryptase. Part 2: structure-activity relationships and requirements for potent activity. Bioorg Med Chem Lett10:2361-6 (2001) Tryptase beta-2/delta/gamma
Name:Tryptase beta-2/delta/gamma
Synonyms:Tryptase
Type:n/a
Mol. Mass.:n/a
Description:ASSAY_ID of ChEMBL is 1510505
Components:This complex has 3 components.
Component 1
Name:Tryptase gamma
Type:PROTEIN
Mol. Mass.:33817.52
Organism:Homo sapiens (Human)
Description:ChEMBL_210833
Residue:321
Component 2
Name:Tryptase beta-2
Synonyms:TPS2 TRYB2_HUMAN Tryptase II Tryptase-2
Type:PROTEIN
Mol. Mass.:30518.79
Organism:Homo sapiens (Human)
Description:ChEMBL_210702
Residue:275
Component 3
Name:Tryptase delta
Synonyms:Delta-tryptase Mast cell mMCP-7-like TRYD_HUMAN Tryptase-3
Type:PROTEIN
Mol. Mass.:26578.73
Organism:Homo sapiens (Human)
Description:ChEMBL_104777
Residue:242
BDBM50093175
NameBDBM50093175
Synonyms:CHEMBL311655 | Derivative of APC-2059
TypeSmall organic molecule
Emp. Form.C34H50N12O4
Mol. Mass.690.8388
SMILES[#7]\[#6](-[#7])=[#7]/c1ccc(-[#6]-[#7]-[#6](=O)-[#7]-2-[#6]-[#6]-[#7](-[#6]-[#6]-2)-[#6](=O)-[#6]-[#6]-[#6]-[#6]-[#6]-[#6]-[#6](=O)-[#7]-2-[#6]-[#6]-[#7](-[#6]-[#6]-2)-[#6](=O)-[#7]-[#6]-c2ccc(cc2)\[#7]=[#6](/[#7])-[#7])cc1