Reaction Details
TargetHistamine H3 receptor
LigandBDBM50093224
Substrate/Competitorn/a
Meas. Tech.ChEBML_86906
Ki 0.580000±n/a nM
Citation Stark, HLigneau, XSadek, BGanellin, CRArrang, JMSchwartz, JCSchunack, W Analogues and derivatives of ciproxifan, a novel prototype for generating potent histamine H3-receptor antagonists. Bioorg Med Chem Lett10:2379-82 (2001) Histamine H3 receptor
Name:Histamine H3 receptor
Type:G Protein-Coupled Receptor (GPCR)
Mol. Mass.:48607.98
Organism:Rattus norvegicus (rat)
Description:n/a
Residue:445
BDBM50093224
NameBDBM50093224
Synonyms:CHEMBL309302 | Cyclopropyl-{4-[3-(1H-imidazol-4-yl)-propoxy]-phenyl}-methanol
TypeSmall organic molecule
Emp. Form.C16H20N2O2
Mol. Mass.272.3422
SMILESOC(C1CC1)c1ccc(OCCCc2cnc[nH]2)cc1