Reaction Details
TargetHistamine H3 receptor
LigandBDBM50093225
Substrate/Competitorn/a
Meas. Tech.ChEBML_86906
Ki 2.1±n/a nM
Citation Stark, HLigneau, XSadek, BGanellin, CRArrang, JMSchwartz, JCSchunack, W Analogues and derivatives of ciproxifan, a novel prototype for generating potent histamine H3-receptor antagonists. Bioorg Med Chem Lett10:2379-82 (2001) Histamine H3 receptor
Name:Histamine H3 receptor
Type:G Protein-Coupled Receptor (GPCR)
Mol. Mass.:48607.98
Organism:Rattus norvegicus (rat)
Description:n/a
Residue:445
BDBM50093225
NameBDBM50093225
Synonyms:CHEMBL76440 | Cyclopropyl-{4-[2-(1H-imidazol-4-yl)-ethoxy]-phenyl}-methanone
TypeSmall organic molecule
Emp. Form.C15H16N2O2
Mol. Mass.256.2997
SMILESO=C(C1CC1)c1ccc(OCCc2cnc[nH]2)cc1