Reaction Details
TargetHistamine H3 receptor
LigandBDBM22541
Substrate/Competitorn/a
Meas. Tech.ChEBML_86906
Ki 0.600000±n/a nM
Citation Stark, HLigneau, XSadek, BGanellin, CRArrang, JMSchwartz, JCSchunack, W Analogues and derivatives of ciproxifan, a novel prototype for generating potent histamine H3-receptor antagonists. Bioorg Med Chem Lett10:2379-82 (2001) Histamine H3 receptor
Name:Histamine H3 receptor
Type:G Protein-Coupled Receptor (GPCR)
Mol. Mass.:48607.98
Organism:Rattus norvegicus (rat)
Description:n/a
Residue:445
BDBM22541
NameBDBM22541
Synonyms:Clobenpropit VUF 9153 VUF9153
TypeSmall organic molecule
Emp. Form.C14H17ClN4S
Mol. Mass.308.83
SMILESNC(SCCCc1cnc[nH]1)=NCc1ccc(Cl)cc1