Reaction Details
TargetProthrombin
LigandBDBM50093301
Substrate/Competitorn/a
Meas. Tech.ChEMBL_208726 (CHEMBL809417)
IC50 1900±n/a nM
Citation Dudley, DABunker, AMChi, LCody, WLHolland, DRIgnasiak, DPJaniczek-Dolphin, NMcClanahan, TBMertz, TENarasimhan, LSRapundalo, STTrautschold, JAVan Huis, CAEdmunds, JJ Rational design, synthesis, and biological activity of benzoxazinones as novel factor Xa inhibitors. J Med Chem43:4063-70 (2000) Prothrombin
Name:Prothrombin
Type:Protein
Mol. Mass.:70029.57
Organism:Homo sapiens (Human)
Description:P00734
Residue:622
BDBM50093301
NameBDBM50093301
Synonyms:3-[4-(5-Dihexylamino-pentyl)-3-oxo-3,4-dihydro-2H-benzo[1,4]oxazin-2-yl]-benzamidine | CHEMBL133328
TypeSmall organic molecule
Emp. Form.C32H48N4O2
Mol. Mass.520.7491
SMILESCCCCCCN(CCCCCC)CCCCCN1C(=O)C(Oc2ccccc12)c1cccc(c1)C(N)=N