Reaction Details
TargetSerine protease 1
LigandBDBM50093299
Substrate/Competitorn/a
Meas. Tech.ChEMBL_213033 (CHEMBL816971)
IC50 1100±n/a nM
Citation Dudley, DABunker, AMChi, LCody, WLHolland, DRIgnasiak, DPJaniczek-Dolphin, NMcClanahan, TBMertz, TENarasimhan, LSRapundalo, STTrautschold, JAVan Huis, CAEdmunds, JJ Rational design, synthesis, and biological activity of benzoxazinones as novel factor Xa inhibitors. J Med Chem43:4063-70 (2000) Serine protease 1
Name:Serine protease 1
Type:Enzyme
Mol. Mass.:26557.80
Organism:Homo sapiens (Human)
Description:P07477
Residue:247
BDBM50093299
NameBDBM50093299
Synonyms:3-[4-(5-Morpholin-4-yl-pentyl)-3-oxo-3,4-dihydro-2H-benzo[1,4]oxazin-2-yl]-benzamidine | CHEMBL130378
TypeSmall organic molecule
Emp. Form.C24H30N4O3
Mol. Mass.422.52
SMILESNC(=N)c1cccc(c1)C1Oc2ccccc2N(CCCCCN2CCOCC2)C1=O