Reaction Details
TargetCoagulation factor X
LigandBDBM50093315
Substrate/Competitorn/a
Meas. Tech.ChEMBL_48967 (CHEMBL661678)
IC50 26000±n/a nM
Citation Dudley, DABunker, AMChi, LCody, WLHolland, DRIgnasiak, DPJaniczek-Dolphin, NMcClanahan, TBMertz, TENarasimhan, LSRapundalo, STTrautschold, JAVan Huis, CAEdmunds, JJ Rational design, synthesis, and biological activity of benzoxazinones as novel factor Xa inhibitors. J Med Chem43:4063-70 (2000) Coagulation factor X
Name:Coagulation factor X
Type:Enzyme
Mol. Mass.:54726.60
Organism:Homo sapiens (Human)
Description:n/a
Residue:488
BDBM50093315
NameBDBM50093315
Synonyms:2-(3,4-Dichloro-phenyl)-4-[5-(2,6-dimethyl-piperidin-1-yl)-pentyl]-4H-benzo[1,4]oxazin-3-one | CHEMBL130673
TypeSmall organic molecule
Emp. Form.C26H32Cl2N2O2
Mol. Mass.475.45
SMILESCC1CCCC(C)N1CCCCCN1C(=O)C(Oc2ccccc12)c1ccc(Cl)c(Cl)c1