Reaction Details
TargetProthrombin
LigandBDBM50093318
Substrate/Competitorn/a
Meas. Tech.ChEMBL_208726 (CHEMBL809417)
IC50 1700±n/a nM
Citation Dudley, DABunker, AMChi, LCody, WLHolland, DRIgnasiak, DPJaniczek-Dolphin, NMcClanahan, TBMertz, TENarasimhan, LSRapundalo, STTrautschold, JAVan Huis, CAEdmunds, JJ Rational design, synthesis, and biological activity of benzoxazinones as novel factor Xa inhibitors. J Med Chem43:4063-70 (2000) Prothrombin
Name:Prothrombin
Type:Protein
Mol. Mass.:70029.57
Organism:Homo sapiens (Human)
Description:P00734
Residue:622
BDBM50093318
NameBDBM50093318
Synonyms:4-{4-[5-(2,6-Dimethyl-piperidin-1-yl)-pentyl]-3-oxo-3,4-dihydro-2H-benzo[1,4]oxazin-2-yl}-benzamidine | CHEMBL130420
TypeSmall organic molecule
Emp. Form.C27H36N4O2
Mol. Mass.448.6003
SMILESCC1CCCC(C)N1CCCCCN1C(=O)C(Oc2ccccc12)c1ccc(cc1)C(N)=N