Reaction Details
TargetCoagulation factor X
LigandBDBM50093308
Substrate/Competitorn/a
Meas. Tech.ChEMBL_48967 (CHEMBL661678)
IC50 840.0±n/a nM
Citation Dudley, DABunker, AMChi, LCody, WLHolland, DRIgnasiak, DPJaniczek-Dolphin, NMcClanahan, TBMertz, TENarasimhan, LSRapundalo, STTrautschold, JAVan Huis, CAEdmunds, JJ Rational design, synthesis, and biological activity of benzoxazinones as novel factor Xa inhibitors. J Med Chem43:4063-70 (2000) Coagulation factor X
Name:Coagulation factor X
Type:Enzyme
Mol. Mass.:54726.60
Organism:Homo sapiens (Human)
Description:n/a
Residue:488
BDBM50093308
NameBDBM50093308
Synonyms:2-(3-Aminomethyl-phenyl)-4-[5-(2,6-dimethyl-piperidin-1-yl)-pentyl]-4H-benzo[1,4]oxazin-3-one | CHEMBL130491
TypeSmall organic molecule
Emp. Form.C27H37N3O2
Mol. Mass.435.6016
SMILESCC1CCCC(C)N1CCCCCN1C(=O)C(Oc2ccccc12)c1cccc(CN)c1