Reaction Details
TargetSerine protease 1
LigandBDBM50093318
Substrate/Competitorn/a
Meas. Tech.ChEMBL_213033 (CHEMBL816971)
IC50 13000±n/a nM
Citation Dudley, DABunker, AMChi, LCody, WLHolland, DRIgnasiak, DPJaniczek-Dolphin, NMcClanahan, TBMertz, TENarasimhan, LSRapundalo, STTrautschold, JAVan Huis, CAEdmunds, JJ Rational design, synthesis, and biological activity of benzoxazinones as novel factor Xa inhibitors. J Med Chem43:4063-70 (2000) Serine protease 1
Name:Serine protease 1
Type:Enzyme
Mol. Mass.:26557.80
Organism:Homo sapiens (Human)
Description:P07477
Residue:247
BDBM50093318
NameBDBM50093318
Synonyms:4-{4-[5-(2,6-Dimethyl-piperidin-1-yl)-pentyl]-3-oxo-3,4-dihydro-2H-benzo[1,4]oxazin-2-yl}-benzamidine | CHEMBL130420
TypeSmall organic molecule
Emp. Form.C27H36N4O2
Mol. Mass.448.6003
SMILESCC1CCCC(C)N1CCCCCN1C(=O)C(Oc2ccccc12)c1ccc(cc1)C(N)=N