Reaction Details
TargetSerine protease 1
LigandBDBM50093302
Substrate/Competitorn/a
Meas. Tech.ChEMBL_213033 (CHEMBL816971)
IC50 300±n/a nM
Citation Dudley, DABunker, AMChi, LCody, WLHolland, DRIgnasiak, DPJaniczek-Dolphin, NMcClanahan, TBMertz, TENarasimhan, LSRapundalo, STTrautschold, JAVan Huis, CAEdmunds, JJ Rational design, synthesis, and biological activity of benzoxazinones as novel factor Xa inhibitors. J Med Chem43:4063-70 (2000) Serine protease 1
Name:Serine protease 1
Type:Enzyme
Mol. Mass.:26557.80
Organism:Homo sapiens (Human)
Description:P07477
Residue:247
BDBM50093302
NameBDBM50093302
Synonyms:3-{4-[4-(2,6-Dimethyl-piperidin-1-yl)-butyl]-3-oxo-3,4-dihydro-2H-benzo[1,4]oxazin-2-yl}-benzamidine | CHEMBL130313
TypeSmall organic molecule
Emp. Form.C26H34N4O2
Mol. Mass.434.5738
SMILESCC1CCCC(C)N1CCCCN1C(=O)C(Oc2ccccc12)c1cccc(c1)C(N)=N