Reaction Details
TargetCoagulation factor X
LigandBDBM50093312
Substrate/Competitorn/a
Meas. Tech.ChEMBL_48967 (CHEMBL661678)
IC50 68.0±n/a nM
Citation Dudley, DABunker, AMChi, LCody, WLHolland, DRIgnasiak, DPJaniczek-Dolphin, NMcClanahan, TBMertz, TENarasimhan, LSRapundalo, STTrautschold, JAVan Huis, CAEdmunds, JJ Rational design, synthesis, and biological activity of benzoxazinones as novel factor Xa inhibitors. J Med Chem43:4063-70 (2000) Coagulation factor X
Name:Coagulation factor X
Type:Enzyme
Mol. Mass.:54726.60
Organism:Homo sapiens (Human)
Description:n/a
Residue:488
BDBM50093312
NameBDBM50093312
Synonyms:3-{4-[6-(2,6-Dimethyl-piperidin-1-yl)-hexyl]-3-oxo-3,4-dihydro-2H-benzo[1,4]oxazin-2-yl}-benzamidine | CHEMBL424260
TypeSmall organic molecule
Emp. Form.C28H38N4O2
Mol. Mass.462.6269
SMILESCC1CCCC(C)N1CCCCCCN1C(=O)C(Oc2ccccc12)c1cccc(c1)C(N)=N