Reaction Details
TargetAcetylcholinesterase
LigandBDBM50537711
Substrate/Competitorn/a
Meas. Tech.ChEMBL_1970373 (CHEMBL4603191)
IC50 10020±n/a nM
Citation Almansour, AIArumugam, NKumar, RSKotresha, DManohar, TSVenketesh, S Design, synthesis and cholinesterase inhibitory activity of novel spiropyrrolidine tethered imidazole heterocyclic hybrids. Bioorg Med Chem Lett30:0 (2020) 
 
Acetylcholinesterase
Name:Acetylcholinesterase
Type:Enzyme
Mol. Mass.:67792.70
Organism:Homo sapiens (Human)
Description:P22303
Residue:614
BDBM50537711
NameBDBM50537711
Synonyms:CHEMBL4644961
TypeSmall organic molecule
Emp. Form.C29H24N6O2
Mol. Mass.488.5399
SMILESCc1ccccc1C1C(C(Cc2c[nH]cn2)NC11c2ccccc2-c2nc3ccccc3nc12)[N+]([O-])=O