Reaction Details
TargetAcetylcholinesterase
LigandBDBM50537716
Substrate/Competitorn/a
Meas. Tech.ChEMBL_1970373 (CHEMBL4603191)
IC50 2050±n/a nM
Citation Almansour, AIArumugam, NKumar, RSKotresha, DManohar, TSVenketesh, S Design, synthesis and cholinesterase inhibitory activity of novel spiropyrrolidine tethered imidazole heterocyclic hybrids. Bioorg Med Chem Lett30:0 (2020) 
 
Acetylcholinesterase
Name:Acetylcholinesterase
Type:Enzyme
Mol. Mass.:67792.70
Organism:Homo sapiens (Human)
Description:P22303
Residue:614
BDBM50537716
NameBDBM50537716
Synonyms:CHEMBL4642244
TypeSmall organic molecule
Emp. Form.C29H24N6O3
Mol. Mass.504.5393
SMILESCOc1ccc(cc1)C1C(C(Cc2c[nH]cn2)NC11c2ccccc2-c2nc3ccccc3nc12)[N+]([O-])=O