Reaction Details
TargetAcetylcholinesterase
LigandBDBM50537718
Substrate/Competitorn/a
Meas. Tech.ChEMBL_1970373 (CHEMBL4603191)
IC50 17040±n/a nM
Citation Almansour, AIArumugam, NKumar, RSKotresha, DManohar, TSVenketesh, S Design, synthesis and cholinesterase inhibitory activity of novel spiropyrrolidine tethered imidazole heterocyclic hybrids. Bioorg Med Chem Lett30:0 (2020) 
 
Acetylcholinesterase
Name:Acetylcholinesterase
Type:Enzyme
Mol. Mass.:67792.70
Organism:Homo sapiens (Human)
Description:P22303
Residue:614
BDBM50537718
NameBDBM50537718
Synonyms:CHEMBL4636399
TypeSmall organic molecule
Emp. Form.C27H21N7O2
Mol. Mass.475.5013
SMILES[O-][N+](=O)C1C(Cc2c[nH]cn2)NC2(C1c1ccccn1)c1ccccc1-c1nc3ccccc3nc21