Reaction Details
TargetCholinesterase
LigandBDBM50537712
Substrate/Competitorn/a
Meas. Tech.ChEMBL_1970374 (CHEMBL4603192)
IC50 13600±n/a nM
Citation Almansour, AIArumugam, NKumar, RSKotresha, DManohar, TSVenketesh, S Design, synthesis and cholinesterase inhibitory activity of novel spiropyrrolidine tethered imidazole heterocyclic hybrids. Bioorg Med Chem Lett30:0 (2020) 
 
Cholinesterase
Name:Cholinesterase
Type:Homotetramer
Mol. Mass.:68422.27
Organism:Homo sapiens (Human)
Description:P06276
Residue:602
BDBM50537712
NameBDBM50537712
Synonyms:CHEMBL4633851
TypeSmall organic molecule
Emp. Form.C29H24N6O2
Mol. Mass.488.5399
SMILESCc1cccc(c1)C1C(C(Cc2c[nH]cn2)NC11c2ccccc2-c2nc3ccccc3nc12)[N+]([O-])=O