Reaction Details
TargetPlatelet-activating factor acetylhydrolase
LigandBDBM50093913
Substrate/Competitorn/a
Meas. Tech.ChEBML_101010
IC50 0.700000±n/a nM
Citation Boyd, HFFell, SCFlynn, STHickey, DMIfe, RJLeach, CAMacphee, CHMilliner, KJMoores, KEPinto, ILPorter, RARawlings, DASmith, SAStansfield, IGTew, DGTheobald, CJWhittaker, CM N-1 substituted pyrimidin-4-ones: novel, orally active inhibitors of lipoprotein-associated phospholipase A2. Bioorg Med Chem Lett10:2557-61 (2001) Platelet-activating factor acetylhydrolase
Name:Platelet-activating factor acetylhydrolase
Type:PROTEIN
Mol. Mass.:50084.41
Organism:Homo sapiens (Human)
Description:ChEMBL_156212
Residue:441
BDBM50093913
NameBDBM50093913
Synonyms:4-[2-(4-Fluoro-benzylsulfanyl)-4-oxo-5-pyrimidin-5-ylmethyl-4H-pyrimidin-1-yl]-N-((E)-octadec-9-enyl)-butyramide | CHEMBL293933
TypeSmall organic molecule
Emp. Form.C38H54FN5O2S
Mol. Mass.663.931
SMILESCCCCCCCC\C=C\CCCCCCCCNC(=O)CCCn1cc(Cc2cncnc2)c(=O)nc1SCc1ccc(F)cc1