Reaction Details
TargetPlatelet-activating factor acetylhydrolase
LigandBDBM50093928
Substrate/Competitorn/a
Meas. Tech.ChEBML_101010
IC50 2±n/a nM
Citation Boyd, HFFell, SCFlynn, STHickey, DMIfe, RJLeach, CAMacphee, CHMilliner, KJMoores, KEPinto, ILPorter, RARawlings, DASmith, SAStansfield, IGTew, DGTheobald, CJWhittaker, CM N-1 substituted pyrimidin-4-ones: novel, orally active inhibitors of lipoprotein-associated phospholipase A2. Bioorg Med Chem Lett10:2557-61 (2001) Platelet-activating factor acetylhydrolase
Name:Platelet-activating factor acetylhydrolase
Type:PROTEIN
Mol. Mass.:50084.41
Organism:Homo sapiens (Human)
Description:ChEMBL_156212
Residue:441
BDBM50093928
NameBDBM50093928
Synonyms:2-[2-(4-Fluoro-benzylsulfanyl)-4-oxo-5-pyrimidin-5-ylmethyl-4H-pyrimidin-1-yl]-N-[6-(4-fluoro-phenyl)-hexyl]-acetamide | CHEMBL83522
TypeSmall organic molecule
Emp. Form.C30H31F2N5O2S
Mol. Mass.563.661
SMILESFc1ccc(CCCCCCNC(=O)Cn2cc(Cc3cncnc3)c(=O)nc2SCc2ccc(F)cc2)cc1