Reaction Details
TargetProteasome subunit beta type-9
LigandBDBM50538185
Substrate/Competitorn/a
Meas. Tech.ChEMBL_1972391 (CHEMBL4605209)
IC50 90±n/a nM
Citation Bhattarai, DLee, MJBaek, AYeo, IJMiller, ZBaek, YMLee, SKim, DEHong, JTKim, KB LMP2 Inhibitors as a Potential Treatment for Alzheimer's Disease. J Med Chem63:3763-3783 (2020) 
 
Proteasome subunit beta type-9
Name:Proteasome subunit beta type-9
Type:PROTEIN
Mol. Mass.:23256.49
Organism:Homo sapiens (Human)
Description:ChEMBL_106197
Residue:219
BDBM50538185
NameBDBM50538185
Synonyms:CHEMBL4638653
TypeSmall organic molecule
Emp. Form.C34H40N6O6
Mol. Mass.628.718
SMILESCC(C)C[C@H](NC(=O)[C@H](Cc1ccc2ccccc2c1)NC(=O)[C@@H]1CCCN1C(=O)CNC(=O)c1cnccn1)C(=O)[C@@]1(C)CO1