Reaction Details
TargetSteroid 17-alpha-hydroxylase/17,20 lyase
LigandBDBM50409041
Substrate/Competitorn/a
Meas. Tech.ChEMBL_50379 (CHEMBL661721)
Ki 3±n/a nM
Citation Hartmann, RWHector, MWachall, BGPalusczak, APalzer, MHuch, VVeith, M Synthesis and evaluation of 17-aliphatic heterocycle-substituted steroidal inhibitors of 17alpha-hydroxylase/C17-20-lyase (P450 17). J Med Chem43:4437-45 (2000) Steroid 17-alpha-hydroxylase/17,20 lyase
Name:Steroid 17-alpha-hydroxylase/17,20 lyase
Type:Enzyme
Mol. Mass.:57255.68
Organism:Rattus norvegicus (Rat)
Description:P11715
Residue:507
BDBM50409041
NameBDBM50409041
Synonyms:CHEMBL2111947
TypeSmall organic molecule
Emp. Form.C21H33NO
Mol. Mass.315.4928
SMILESC[C@]12CC[C@H]3[C@@H](CC=C4C[C@@H](O)CC[C@]34C)[C@@H]1CC[C@@H]2[C@H]1CN1