Reaction Details
TargetCholesteryl ester transfer protein
LigandBDBM50094519
Substrate/Competitorn/a
Meas. Tech.ChEMBL_48938 (CHEMBL661652)
IC50 20±n/a nM
Citation Durley, RCGrapperhaus, MLMassa, MAMischke, DAParnas, BLFobian, YMRath, NPHonda, DDZeng, MConnolly, DTHeuvelman, DMWitherbee, BJGlenn, KCKrul, ESSmith, MESikorski, JA Discovery of chiral N,N-disubstituted trifluoro-3-amino-2-propanols as potent inhibitors of cholesteryl ester transfer protein. J Med Chem43:4575-8 (2001) Cholesteryl ester transfer protein
Name:Cholesteryl ester transfer protein
Type:Enzyme
Mol. Mass.:54751.53
Organism:Homo sapiens (Human)
Description:P11597
Residue:493
BDBM50094519
NameBDBM50094519
Synonyms:(R)-1,1,1-Trifluoro-3-{(3-phenoxy-phenyl)-[3-(1,1,2,2-tetrafluoro-ethoxy)-benzyl]-amino}-propan-2-ol (R)-3-((3-(1,1,2,2-tetrafluoroethoxy)benzyl)(3-phenoxyphenyl)amino)-1,1,1-trifluoropropan-2-ol CHEMBL303954 | SC-795
TypeSmall organic molecule
Emp. Form.C24H20F7NO3
Mol. Mass.503.4093
SMILESO[C@H](CN(Cc1cccc(OC(F)(F)C(F)F)c1)c1cccc(Oc2ccccc2)c1)C(F)(F)F