Reaction Details
TargetCytochrome P450 2C9
LigandBDBM50538668
Substrate/Competitorn/a
Meas. Tech.ChEMBL_1973676 (CHEMBL4606494)
EC50 50000±n/a nM
Citation Janetka, JWHopper, ATYang, ZBarks, JDhason, MSWang, QSibley, LD Optimizing Pyrazolopyrimidine Inhibitors of Calcium Dependent Protein Kinase 1 for Treatment of Acute and Chronic Toxoplasmosis. J Med Chem63:6144-6163 (2020) 
 
Cytochrome P450 2C9
Name:Cytochrome P450 2C9
Type:Enzyme
Mol. Mass.:55636.33
Organism:Homo sapiens (Human)
Description:P11712
Residue:490
BDBM50538668
NameBDBM50538668
Synonyms:CHEMBL4634455 | US11518761, Example 159
TypeSmall organic molecule
Emp. Form.C14H11F3N6O
Mol. Mass.336.2719
SMILESNc1ncnc2n(nc(Oc3cc(ccn3)C(F)(F)F)c12)C1CC1