Reaction Details
TargetATP-dependent translocase ABCB1
LigandBDBM50095340
Substrate/Competitorn/a
Meas. Tech.ChEBML_147988
Kd 6800±n/a nM
Citation Boumendjel, ABois, FBeney, CMariotte, AMConseil, GDi Pietro, A B-ring substituted 5,7-dihydroxyflavonols with high-affinity binding to P-glycoprotein responsible for cell multidrug resistance. Bioorg Med Chem Lett11:75-7 (2001) ATP-dependent translocase ABCB1
Name:ATP-dependent translocase ABCB1
Type:Protein
Mol. Mass.:140669.02
Organism:Mus musculus (Mouse)
Description:P21447
Residue:1276
BDBM50095340
NameBDBM50095340
Synonyms:2-(4-Fluoro-phenyl)-3,5,7-trihydroxy-chromen-4-one | CHEMBL165905
TypeSmall organic molecule
Emp. Form.C15H9FO5
Mol. Mass.288.2274
SMILESOc1cc(O)c2c(c1)oc(c(O)c2=O)-c1ccc(F)cc1