Reaction Details
TargetCollagenase 3
LigandBDBM50095555
Substrate/Competitorn/a
Meas. Tech.ChEMBL_106477 (CHEMBL719146)
IC50 2±n/a nM
Citation Natchus, MGBookland, RGDe, BAlmstead, NGPikul, SJanusz, MJHeitmeyer, SAHookfin, EBHsieh, LCDowty, MEDietsch, CRPatel, VSGarver, SMGu, FPokross, MEMieling, GEBaker, TRFoltz, DJPeng, SXBornes, DMStrojnowski, MJTaiwo, YO Development of new hydroxamate matrix metalloproteinase inhibitors derived from functionalized 4-aminoprolines. J Med Chem43:4948-63 (2001) Collagenase 3
Name:Collagenase 3
Type:Enzyme
Mol. Mass.:53808.06
Organism:Homo sapiens (Human)
Description:P45452
Residue:471
BDBM50095555
NameBDBM50095555
Synonyms:4-(3-Allyl-2,5-dioxo-imidazolidin-1-yl)-1-[4-(2-methoxy-ethoxy)-benzenesulfonyl]-pyrrolidine-2-carboxylic acid hydroxyamide | CHEMBL356504
TypeSmall organic molecule
Emp. Form.C20H26N4O8S
Mol. Mass.482.507
SMILESCOCCOc1ccc(cc1)S(=O)(=O)N1C[C@H](C[C@@H]1C(=O)NO)n1c(O)cn(CC=C)c1=O