Reaction Details
TargetCollagenase 3
LigandBDBM50095556
Substrate/Competitorn/a
Meas. Tech.ChEMBL_106477 (CHEMBL719146)
IC50 2±n/a nM
Citation Natchus, MGBookland, RGDe, BAlmstead, NGPikul, SJanusz, MJHeitmeyer, SAHookfin, EBHsieh, LCDowty, MEDietsch, CRPatel, VSGarver, SMGu, FPokross, MEMieling, GEBaker, TRFoltz, DJPeng, SXBornes, DMStrojnowski, MJTaiwo, YO Development of new hydroxamate matrix metalloproteinase inhibitors derived from functionalized 4-aminoprolines. J Med Chem43:4948-63 (2001) Collagenase 3
Name:Collagenase 3
Type:Enzyme
Mol. Mass.:53808.06
Organism:Homo sapiens (Human)
Description:P45452
Residue:471
BDBM50095556
NameBDBM50095556
Synonyms:1-(4-Methoxy-benzenesulfonyl)-4-(4-methoxy-benzenesulfonylamino)-pyrrolidine-2-carboxylic acid hydroxyamide | CHEMBL147910
TypeSmall organic molecule
Emp. Form.C19H23N3O8S2
Mol. Mass.485.531
SMILESCOc1ccc(cc1)S(=O)(=O)N[C@H]1C[C@@H](N(C1)S(=O)(=O)c1ccc(OC)cc1)C(=O)NO