Reaction Details
TargetCollagenase 3
LigandBDBM50095569
Substrate/Competitorn/a
Meas. Tech.ChEMBL_106477 (CHEMBL719146)
IC50 0.8±n/a nM
Citation Natchus, MGBookland, RGDe, BAlmstead, NGPikul, SJanusz, MJHeitmeyer, SAHookfin, EBHsieh, LCDowty, MEDietsch, CRPatel, VSGarver, SMGu, FPokross, MEMieling, GEBaker, TRFoltz, DJPeng, SXBornes, DMStrojnowski, MJTaiwo, YO Development of new hydroxamate matrix metalloproteinase inhibitors derived from functionalized 4-aminoprolines. J Med Chem43:4948-63 (2001) Collagenase 3
Name:Collagenase 3
Type:Enzyme
Mol. Mass.:53808.06
Organism:Homo sapiens (Human)
Description:P45452
Residue:471
BDBM50095569
NameBDBM50095569
Synonyms:4-(Methanesulfonyl-propyl-amino)-1-(4-methoxy-benzenesulfonyl)-pyrrolidine-2-carboxylic acid hydroxyamide | CHEMBL147629
TypeSmall organic molecule
Emp. Form.C16H25N3O7S2
Mol. Mass.435.516
SMILESCCCN([C@H]1C[C@@H](N(C1)S(=O)(=O)c1ccc(OC)cc1)C(=O)NO)S(C)(=O)=O