Reaction Details
TargetCollagenase 3
LigandBDBM50095570
Substrate/Competitorn/a
Meas. Tech.ChEMBL_106477 (CHEMBL719146)
IC50 0.7±n/a nM
Citation Natchus, MGBookland, RGDe, BAlmstead, NGPikul, SJanusz, MJHeitmeyer, SAHookfin, EBHsieh, LCDowty, MEDietsch, CRPatel, VSGarver, SMGu, FPokross, MEMieling, GEBaker, TRFoltz, DJPeng, SXBornes, DMStrojnowski, MJTaiwo, YO Development of new hydroxamate matrix metalloproteinase inhibitors derived from functionalized 4-aminoprolines. J Med Chem43:4948-63 (2001) Collagenase 3
Name:Collagenase 3
Type:Enzyme
Mol. Mass.:53808.06
Organism:Homo sapiens (Human)
Description:P45452
Residue:471
BDBM50095570
NameBDBM50095570
Synonyms:4-(3-Methyl-2,5-dioxo-imidazolidin-1-yl)-1-[4-(pyridin-4-yloxy)-benzenesulfonyl]-pyrrolidine-2-carboxylic acid hydroxyamide | CHEMBL343414
TypeSmall organic molecule
Emp. Form.C20H21N5O7S
Mol. Mass.475.475
SMILESCn1cc(O)n([C@H]2C[C@@H](N(C2)S(=O)(=O)c2ccc(Oc3ccncc3)cc2)C(=O)NO)c1=O