Reaction Details
TargetCollagenase 3
LigandBDBM50095584
Substrate/Competitorn/a
Meas. Tech.ChEMBL_106477 (CHEMBL719146)
IC50 2±n/a nM
Citation Natchus, MGBookland, RGDe, BAlmstead, NGPikul, SJanusz, MJHeitmeyer, SAHookfin, EBHsieh, LCDowty, MEDietsch, CRPatel, VSGarver, SMGu, FPokross, MEMieling, GEBaker, TRFoltz, DJPeng, SXBornes, DMStrojnowski, MJTaiwo, YO Development of new hydroxamate matrix metalloproteinase inhibitors derived from functionalized 4-aminoprolines. J Med Chem43:4948-63 (2001) Collagenase 3
Name:Collagenase 3
Type:Enzyme
Mol. Mass.:53808.06
Organism:Homo sapiens (Human)
Description:P45452
Residue:471
BDBM50095584
NameBDBM50095584
Synonyms:4-(2-Benzyloxy-3-phenyl-propionylamino)-1-(4-methoxy-benzenesulfonyl)-pyrrolidine-2-carboxylic acid hydroxyamide | CHEMBL343911
TypeSmall organic molecule
Emp. Form.C28H31N3O7S
Mol. Mass.553.627
SMILESCOc1ccc(cc1)S(=O)(=O)N1C[C@H](C[C@@H]1C(=O)NO)NC(=O)[C@H](Cc1ccccc1)OCc1ccccc1