Reaction Details
Target72 kDa type IV collagenase
LigandBDBM50095581
Substrate/Competitorn/a
Meas. Tech.ChEMBL_104368 (CHEMBL715829)
IC50 0.3±n/a nM
Citation Natchus, MGBookland, RGDe, BAlmstead, NGPikul, SJanusz, MJHeitmeyer, SAHookfin, EBHsieh, LCDowty, MEDietsch, CRPatel, VSGarver, SMGu, FPokross, MEMieling, GEBaker, TRFoltz, DJPeng, SXBornes, DMStrojnowski, MJTaiwo, YO Development of new hydroxamate matrix metalloproteinase inhibitors derived from functionalized 4-aminoprolines. J Med Chem43:4948-63 (2001) 72 kDa type IV collagenase
Name:72 kDa type IV collagenase
Type:Enzyme
Mol. Mass.:73870.36
Organism:Homo sapiens (Human)
Description: P08253
Residue:660
BDBM50095581
NameBDBM50095581
Synonyms:4-(2-Benzyloxy-propionylamino)-1-(4-methoxy-benzenesulfonyl)-pyrrolidine-2-carboxylic acid hydroxyamide | CHEMBL149431
TypeSmall organic molecule
Emp. Form.C22H27N3O7S
Mol. Mass.477.531
SMILESCOc1ccc(cc1)S(=O)(=O)N1C[C@H](C[C@@H]1C(=O)NO)NC(=O)[C@H](C)OCc1ccccc1