Reaction Details
TargetCollagenase 3
LigandBDBM50095590
Substrate/Competitorn/a
Meas. Tech.ChEMBL_106477 (CHEMBL719146)
IC50 0.9±n/a nM
Citation Natchus, MGBookland, RGDe, BAlmstead, NGPikul, SJanusz, MJHeitmeyer, SAHookfin, EBHsieh, LCDowty, MEDietsch, CRPatel, VSGarver, SMGu, FPokross, MEMieling, GEBaker, TRFoltz, DJPeng, SXBornes, DMStrojnowski, MJTaiwo, YO Development of new hydroxamate matrix metalloproteinase inhibitors derived from functionalized 4-aminoprolines. J Med Chem43:4948-63 (2001) Collagenase 3
Name:Collagenase 3
Type:Enzyme
Mol. Mass.:53808.06
Organism:Homo sapiens (Human)
Description:P45452
Residue:471
BDBM50095590
NameBDBM50095590
Synonyms:1-(4-Butoxy-benzenesulfonyl)-4-(2-hydroxy-4-methyl-pentanoylamino)-pyrrolidine-2-carboxylic acid hydroxyamide | CHEMBL147738
TypeSmall organic molecule
Emp. Form.C21H33N3O7S
Mol. Mass.471.568
SMILESCCCCOc1ccc(cc1)S(=O)(=O)N1C[C@H](C[C@@H]1C(=O)NO)NC(=O)[C@@H](O)CC(C)C