Reaction Details
TargetCollagenase 3
LigandBDBM50095576
Substrate/Competitorn/a
Meas. Tech.ChEMBL_106477 (CHEMBL719146)
IC50 0.3±n/a nM
Citation Natchus, MGBookland, RGDe, BAlmstead, NGPikul, SJanusz, MJHeitmeyer, SAHookfin, EBHsieh, LCDowty, MEDietsch, CRPatel, VSGarver, SMGu, FPokross, MEMieling, GEBaker, TRFoltz, DJPeng, SXBornes, DMStrojnowski, MJTaiwo, YO Development of new hydroxamate matrix metalloproteinase inhibitors derived from functionalized 4-aminoprolines. J Med Chem43:4948-63 (2001) Collagenase 3
Name:Collagenase 3
Type:Enzyme
Mol. Mass.:53808.06
Organism:Homo sapiens (Human)
Description:P45452
Residue:471
BDBM50095576
NameBDBM50095576
Synonyms:1-(4-Butoxy-benzenesulfonyl)-4-(2,5-dioxo-3-propyl-imidazolidin-1-yl)-pyrrolidine-2-carboxylic acid hydroxyamide | CHEMBL147005
TypeSmall organic molecule
Emp. Form.C21H30N4O7S
Mol. Mass.482.551
SMILESCCCCOc1ccc(cc1)S(=O)(=O)N1C[C@H](C[C@@H]1C(=O)NO)n1c(O)cn(CCC)c1=O