Reaction Details
TargetCollagenase 3
LigandBDBM50095546
Substrate/Competitorn/a
Meas. Tech.ChEMBL_106477 (CHEMBL719146)
IC50 0.4±n/a nM
Citation Natchus, MGBookland, RGDe, BAlmstead, NGPikul, SJanusz, MJHeitmeyer, SAHookfin, EBHsieh, LCDowty, MEDietsch, CRPatel, VSGarver, SMGu, FPokross, MEMieling, GEBaker, TRFoltz, DJPeng, SXBornes, DMStrojnowski, MJTaiwo, YO Development of new hydroxamate matrix metalloproteinase inhibitors derived from functionalized 4-aminoprolines. J Med Chem43:4948-63 (2001) Collagenase 3
Name:Collagenase 3
Type:Enzyme
Mol. Mass.:53808.06
Organism:Homo sapiens (Human)
Description:P45452
Residue:471
BDBM50095546
NameBDBM50095546
Synonyms:4-Piperidin-1-yl-1-(4-propoxy-benzenesulfonyl)-pyrrolidine-2-carboxylic acid hydroxyamide | CHEMBL358061
TypeSmall organic molecule
Emp. Form.C19H29N3O5S
Mol. Mass.411.516
SMILESCCCOc1ccc(cc1)S(=O)(=O)N1C[C@H](C[C@@H]1C(=O)NO)N1CCCCC1