Reaction Details
TargetMuscarinic acetylcholine receptor M3
LigandBDBM50095676
Substrate/Competitorn/a
Meas. Tech.ChEMBL_138696 (CHEMBL747663)
Ki 6.4±n/a nM
Citation Mitsuya, MKobayashi, KKawakami, KSatoh, AOgino, YKakikawa, TOhtake, NKimura, THirose, HSato, ANumazawa, THasegawa, TNoguchi, KMase, T A potent, long-acting, orally active (2R)-2-[(1R)-3, 3-difluorocyclopentyl]-2-hydroxy-2-phenylacetamide: novel muscarinic M(3) receptor antagonist with high selectivity for M(3) over M(2) receptors. J Med Chem43:5017-29 (2001) Muscarinic acetylcholine receptor M3
Name:Muscarinic acetylcholine receptor M3
Type:Enzyme
Mol. Mass.:66151.03
Organism:Homo sapiens (Human)
Description:P20309
Residue:590
BDBM50095676
NameBDBM50095676
Synonyms:2-Cyclopentyl-2-hydroxy-N-[1-(4-methyl-benzyl)-piperidin-4-yl]-2-phenyl-acetamide | CHEMBL149486
TypeSmall organic molecule
Emp. Form.C26H34N2O2
Mol. Mass.406.5604
SMILESCc1ccc(CN2CCC(CC2)NC(=O)C(O)(C2CCCC2)c2ccccc2)cc1