Reaction Details
TargetMuscarinic acetylcholine receptor M1
LigandBDBM50095683
Substrate/Competitorn/a
Meas. Tech.ChEMBL_138399 (CHEMBL744762)
Ki 8.5±n/a nM
Citation Mitsuya, MKobayashi, KKawakami, KSatoh, AOgino, YKakikawa, TOhtake, NKimura, THirose, HSato, ANumazawa, THasegawa, TNoguchi, KMase, T A potent, long-acting, orally active (2R)-2-[(1R)-3, 3-difluorocyclopentyl]-2-hydroxy-2-phenylacetamide: novel muscarinic M(3) receptor antagonist with high selectivity for M(3) over M(2) receptors. J Med Chem43:5017-29 (2001) Muscarinic acetylcholine receptor M1
Name:Muscarinic acetylcholine receptor M1
Type:Protein
Mol. Mass.:51442.54
Organism:Homo sapiens (Human)
Description:P11229
Residue:460
BDBM50095683
NameBDBM50095683
Synonyms:2-Cyclopentyl-2-hydroxy-N-[1-(3-methoxy-benzyl)-piperidin-4-yl]-2-phenyl-acetamide | CHEMBL148450
TypeSmall organic molecule
Emp. Form.C26H34N2O3
Mol. Mass.422.5598
SMILESCOc1cccc(CN2CCC(CC2)NC(=O)C(O)(C2CCCC2)c2ccccc2)c1