Reaction Details
TargetMuscarinic acetylcholine receptor M2
LigandBDBM50095680
Substrate/Competitorn/a
Meas. Tech.ChEMBL_139640 (CHEMBL748253)
Ki 24±n/a nM
Citation Mitsuya, MKobayashi, KKawakami, KSatoh, AOgino, YKakikawa, TOhtake, NKimura, THirose, HSato, ANumazawa, THasegawa, TNoguchi, KMase, T A potent, long-acting, orally active (2R)-2-[(1R)-3, 3-difluorocyclopentyl]-2-hydroxy-2-phenylacetamide: novel muscarinic M(3) receptor antagonist with high selectivity for M(3) over M(2) receptors. J Med Chem43:5017-29 (2001) Muscarinic acetylcholine receptor M2
Name:Muscarinic acetylcholine receptor M2
Type:GPCR
Mol. Mass.:51730.61
Organism:Homo sapiens (Human)
Description:P08172
Residue:466
BDBM50095680
NameBDBM50095680
Synonyms:2-Cyclopentyl-2-hydroxy-N-[1-(5-methyl-thiophen-3-ylmethyl)-piperidin-4-yl]-2-phenyl-acetamide | CHEMBL356305
TypeSmall organic molecule
Emp. Form.C24H32N2O2S
Mol. Mass.412.588
SMILESCc1cc(CN2CCC(CC2)NC(=O)C(O)(C2CCCC2)c2ccccc2)cs1