Reaction Details
TargetDelta-type opioid receptor
LigandBDBM50095708
Substrate/Competitorn/a
Meas. Tech.ChEMBL_146344 (CHEMBL753793)
Ki 56±n/a nM
Citation May, ELJacobson, AEMattson, MVTraynor, JRWoods, JHHarris, LSBowman, ERAceto, MD Synthesis and in vitro and in vivo activity of (-)-(1R,5R,9R)- and (+)-(1S,5S,9S)-N-alkenyl-, -N-alkynyl-, and -N-cyanoalkyl-5, 9-dimethyl-2'-hydroxy-6,7-benzomorphan homologues. J Med Chem43:5030-6 (2001) Delta-type opioid receptor
Name:Delta-type opioid receptor
Type:Enzyme Catalytic Domain
Mol. Mass.:40577.25
Organism:MOUSE
Description:P32300
Residue:372
BDBM50095708
NameBDBM50095708
Synonyms:3-Hex-5-enyl-6,11-dimethyl-1,2,3,4,5,6-hexahydro-2,6-methano-benzo[d]azocin-8-ol | CHEMBL147581
TypeSmall organic molecule
Emp. Form.C20H29NO
Mol. Mass.299.4504
SMILESC[C@H]1C2Cc3ccc(O)cc3[C@@]1(C)CCN2CCCCC=C