Reaction Details
TargetDelta-type opioid receptor
LigandBDBM50095692
Substrate/Competitorn/a
Meas. Tech.ChEMBL_146344 (CHEMBL753793)
Ki 140±n/a nM
Citation May, ELJacobson, AEMattson, MVTraynor, JRWoods, JHHarris, LSBowman, ERAceto, MD Synthesis and in vitro and in vivo activity of (-)-(1R,5R,9R)- and (+)-(1S,5S,9S)-N-alkenyl-, -N-alkynyl-, and -N-cyanoalkyl-5, 9-dimethyl-2'-hydroxy-6,7-benzomorphan homologues. J Med Chem43:5030-6 (2001) Delta-type opioid receptor
Name:Delta-type opioid receptor
Type:Enzyme Catalytic Domain
Mol. Mass.:40577.25
Organism:MOUSE
Description:P32300
Residue:372
BDBM50095692
NameBDBM50095692
Synonyms:6,11-Dimethyl-3-pent-4-ynyl-1,2,3,4,5,6-hexahydro-2,6-methano-benzo[d]azocin-8-ol | CHEMBL146575
TypeSmall organic molecule
Emp. Form.C19H25NO
Mol. Mass.283.4079
SMILESC[C@H]1C2Cc3ccc(O)cc3[C@@]1(C)CCN2CCCC#C