Reaction Details
TargetKappa-type opioid receptor
LigandBDBM50095711
Substrate/Competitorn/a
Meas. Tech.ChEMBL_145566 (CHEMBL749570)
Ki 400±n/a nM
Citation May, ELJacobson, AEMattson, MVTraynor, JRWoods, JHHarris, LSBowman, ERAceto, MD Synthesis and in vitro and in vivo activity of (-)-(1R,5R,9R)- and (+)-(1S,5S,9S)-N-alkenyl-, -N-alkynyl-, and -N-cyanoalkyl-5, 9-dimethyl-2'-hydroxy-6,7-benzomorphan homologues. J Med Chem43:5030-6 (2001) Kappa-type opioid receptor
Name:Kappa-type opioid receptor
Type:Enzyme
Mol. Mass.:42656.78
Organism:Mus musculus (Mouse)
Description:P33534
Residue:380
BDBM50095711
NameBDBM50095711
Synonyms:6,11-Dimethyl-3-pent-4-enyl-1,2,3,4,5,6-hexahydro-2,6-methano-benzo[d]azocin-8-ol | CHEMBL148019
TypeSmall organic molecule
Emp. Form.C19H27NO
Mol. Mass.285.4238
SMILESCC1C2Cc3ccc(O)cc3[C@@]1(C)CCN2CCCC=C