Reaction Details
TargetSerine/threonine-protein kinase DCLK1
LigandBDBM50337135
Substrate/Competitorn/a
Meas. Tech.ChEMBL_1979827 (CHEMBL4612962)
IC50 187±n/a nM
Citation Ferguson, FMLiu, YHarshbarger, WHuang, LWang, JDeng, XCapuzzi, SJMuratov, ENTropsha, AMuthuswamy, SWestover, KDGray, NS Synthesis and Structure-Activity Relationships of DCLK1 Kinase Inhibitors Based on a 5,11-Dihydro-6 J Med Chem63:7817-7826 (2020) 
 
Serine/threonine-protein kinase DCLK1
Name:Serine/threonine-protein kinase DCLK1
Type:PROTEIN
Mol. Mass.:82239.64
Organism:Homo sapiens (Human)
Description:ChEMBL_774446
Residue:740
BDBM50337135
NameBDBM50337135
Synonyms:4-((5,11-dimethyl-6-oxo-6,11-dihydro-5H-benzo[e]pyrimido[5,4-b][1,4]diazepin-2-yl)amino)benzenesulfonamide CHEMBL1673047 | US11155556, No. 16
TypeSmall organic molecule
Emp. Form.C19H18N6O3S
Mol. Mass.410.45
SMILESCN1c2ccccc2C(=O)N(C)c2cnc(Nc3ccc(cc3)S(N)(=O)=O)nc12