Reaction Details
TargetLeucine-rich repeat serine/threonine-protein kinase 2
LigandBDBM50337135
Substrate/Competitorn/a
Meas. Tech.ChEMBL_1979830 (CHEMBL4612965)
IC50 7.0±n/a nM
Citation Ferguson, FMLiu, YHarshbarger, WHuang, LWang, JDeng, XCapuzzi, SJMuratov, ENTropsha, AMuthuswamy, SWestover, KDGray, NS Synthesis and Structure-Activity Relationships of DCLK1 Kinase Inhibitors Based on a 5,11-Dihydro-6 J Med Chem63:7817-7826 (2020) 
 
Leucine-rich repeat serine/threonine-protein kinase 2
Name:Leucine-rich repeat serine/threonine-protein kinase 2
Type:Protein
Mol. Mass.:286113.20
Organism:Homo sapiens (Human)
Description:Q5S007
Residue:2527
BDBM50337135
NameBDBM50337135
Synonyms:4-((5,11-dimethyl-6-oxo-6,11-dihydro-5H-benzo[e]pyrimido[5,4-b][1,4]diazepin-2-yl)amino)benzenesulfonamide CHEMBL1673047 | US11155556, No. 16
TypeSmall organic molecule
Emp. Form.C19H18N6O3S
Mol. Mass.410.45
SMILESCN1c2ccccc2C(=O)N(C)c2cnc(Nc3ccc(cc3)S(N)(=O)=O)nc12