Reaction Details
TargetCathepsin K
LigandBDBM50096392
Substrate/Competitorn/a
Meas. Tech.ChEBML_216707
Ki 10.00±n/a nM
Citation Fenwick, AEGribble, ADIfe, RJStevens, NWitherington, J Diastereoselective synthesis, activity and chiral stability of cyclic alkoxyketone inhibitors of cathepsin K. Bioorg Med Chem Lett11:199-202 (2001) Cathepsin K
Name:Cathepsin K
Type:Enzyme
Mol. Mass.:36975.68
Organism:Homo sapiens (Human)
Description:P43235
Residue:329
BDBM50096392
NameBDBM50096392
Synonyms:(S)-2-[2-(3,4-Dimethoxy-phenyl)-acetylamino]-4-methyl-pentanoic acid (3-oxo-tetrahydro-pyran-4-yl)-amide | CHEMBL61820
TypeSmall organic molecule
Emp. Form.C21H30N2O6
Mol. Mass.406.4727
SMILESCOc1ccc(CC(=O)N[C@@H](CC(C)C)C(=O)NC2CCOCC2=O)cc1OC