Reaction Details
TargetCathepsin K
LigandBDBM19815
Substrate/Competitorn/a
Meas. Tech.ChEMBL_48348 (CHEMBL663337)
Ki 70±n/a nM
Citation Fenwick, AEGribble, ADIfe, RJStevens, NWitherington, J Diastereoselective synthesis, activity and chiral stability of cyclic alkoxyketone inhibitors of cathepsin K. Bioorg Med Chem Lett11:199-202 (2001) Cathepsin K
Name:Cathepsin K
Type:Enzyme
Mol. Mass.:36975.68
Organism:Homo sapiens (Human)
Description:P43235
Residue:329
BDBM19815
NameBDBM19815
Synonyms:(2S)-2-(1-benzothiophen-2-ylformamido)-4-methyl-N-(3-oxooxan-4-yl)pentanamide CHEMBL305084
TypeSmall organic molecule
Emp. Form.C20H24N2O4S
Mol. Mass.388.481
SMILESCC(C)C[C@H](NC(=O)c1cc2ccccc2s1)C(=O)NC1CCOCC1=O