Reaction Details
TargetProthrombin
LigandBDBM50096459
Substrate/Competitorn/a
Meas. Tech.ChEBML_208507
Ki 771±n/a nM
Citation Heinelt, UHerok, SMatter, HWildgoose, P Solid-phase optimisation of achiral amidinobenzyl indoles as potent and selective factor Xa inhibitors. Bioorg Med Chem Lett11:227-30 (2001) Prothrombin
Name:Prothrombin
Type:Protein
Mol. Mass.:70029.57
Organism:Homo sapiens (Human)
Description:P00734
Residue:622
BDBM50096459
NameBDBM50096459
Synonyms:1-(3-Carbamimidoyl-benzyl)-4-hydroxy-1H-indole-2-carboxylic acid 3,5-dichloro-benzylamide | CHEMBL75544
TypeSmall organic molecule
Emp. Form.C24H20Cl2N4O2
Mol. Mass.467.347
SMILESNC(=N)c1cccc(Cn2c(cc3c(O)cccc23)C(=O)NCc2cc(Cl)cc(Cl)c2)c1